KBJD,raw_ap_chosen,post_decorr_ap_chosen,final_ap_chosen,err_ap_chosen,raw_ap_0,post_decorr_ap_0,final_ap_0,err_ap_0,raw_ap_1,post_decorr_ap_1,final_ap_1,err_ap_1,raw_ap_2,post_decorr_ap_2,final_ap_2,err_ap_2,raw_ap_3,post_decorr_ap_3,final_ap_3,err_ap_3,raw_ap_4,post_decorr_ap_4,final_ap_4,err_ap_4,raw_ap_5,post_decorr_ap_5,final_ap_5,err_ap_5,raw_ap_6,post_decorr_ap_6,final_ap_6,err_ap_6
2060.28418946,16.93511,,,0.02826,16.93511,,,0.02826,16.42906,,,0.01966,16.63567,,,0.02633,17.26374,,,0.05187,,,,,,,,,,,,
2060.30462177,16.92642,,,0.02814,16.92642,,,0.02814,16.41928,,,0.01956,16.60778,,,0.02576,17.17869,,,0.04815,,,,,,,,,,,,
2060.32505398,16.83833,,,0.02603,16.83833,,,0.02603,16.35686,,,0.01853,16.54242,,,0.02434,17.09524,,,0.04473,,,,,,,,,,,,
2060.34548609,16.76946,,,0.02471,16.76946,,,0.02471,16.30872,,,0.01793,16.50791,,,0.02384,17.09673,,,0.04529,,,,,,,,,,,,
2060.3659184,16.74096,,,0.02415,16.74096,,,0.02415,16.29105,,,0.01769,16.50548,,,0.02386,17.13274,,,0.04696,,,,,,,,,,,,
2060.3863506,16.61927,,,0.02148,16.61927,,,0.02148,16.19676,,,0.01614,16.41553,,,0.02185,17.04721,,,0.04317,,,,,,,,,,,,
2060.40678281,16.6423,,,0.02212,16.6423,,,0.02212,16.21851,,,0.0166,16.4491,,,0.02272,17.12052,,,0.04656,,,,,,,,,,,,
2060.42721502,16.6006,,,0.02094,16.6006,,,0.02094,16.18614,,,0.01584,16.40561,,,0.02146,17.0357,,,0.04235,,,,,,,,,,,,
2060.44764723,16.58494,,,0.02083,16.58494,,,0.02083,16.17283,,,0.01579,16.40095,,,0.02157,17.05754,,,0.0436,,,,,,,,,,,,
2060.46807943,16.59325,,,0.02113,16.59325,,,0.02113,16.18022,,,0.01601,16.41054,,,0.02191,17.07164,,,0.04447,,,,,,,,,,,,
2060.48851164,16.83717,,,0.02664,16.83717,,,0.02664,16.34805,,,0.01882,16.61986,,,0.02676,17.46067,,,0.06412,,,,,,,,,,,,
2060.50894385,16.51844,,,0.01952,16.51844,,,0.01952,16.12382,,,0.01504,16.34322,,,0.02038,16.96306,,,0.03982,,,,,,,,,,,,
2060.52937605,16.62786,,,0.02187,16.62786,,,0.02187,16.23191,,,0.01683,16.51065,,,0.02408,17.34648,,,0.05743,,,,,,,,,,,,
2060.54980826,16.60988,,,0.02185,16.60988,,,0.02185,16.21602,,,0.01685,16.49104,,,0.02403,17.30672,,,0.05625,,,,,,,,,,,,
2060.57024046,16.46419,,,0.02054,16.46419,,,0.02054,16.10661,,,0.01638,16.34567,,,0.02259,17.02897,,,0.04682,,,,,,,,,,,,
2060.59067277,16.60234,,,0.02086,16.60234,,,0.02086,16.22176,,,0.01628,16.50851,,,0.02346,17.36597,,,0.05707,,,,,,,,,,,,
2060.61110487,16.59672,,,0.02132,16.59672,,,0.02132,16.20764,,,0.01651,16.48301,,,0.02355,17.29875,,,0.05513,,,,,,,,,,,,
2060.63153707,16.67374,,,0.02271,16.67374,,,0.02271,16.274,,,0.01742,16.57831,,,0.02551,17.52002,,,0.06706,,,,,,,,,,,,
2060.65196938,16.69911,,,0.02331,16.69911,,,0.02331,16.29873,,,0.01787,16.61852,,,0.02654,17.6351,,,0.07476,,,,,,,,,,,,
2060.67240148,16.7947,,,0.02515,16.7947,,,0.02515,16.38142,,,0.01905,16.74974,,,0.0296,18.05312,,,0.10859,,,,,,,,,,,,
2060.69283378,16.82142,,,0.02614,16.82142,,,0.02614,16.40233,,,0.01969,16.78697,,,0.03106,18.21214,,,0.12746,,,,,,,,,,,,
2060.71326598,16.58581,,,0.02067,16.58581,,,0.02067,16.19043,,,0.01592,16.4574,,,0.02253,17.23318,,,0.05083,,,,,,,,,,,,
2060.73369808,16.72872,,,0.02412,16.72872,,,0.02412,16.32366,,,0.01841,16.66543,,,0.02791,17.78803,,,0.08668,,,,,,,,,,,,
2060.75413038,17.13473,,,0.03434,17.13473,,,0.03434,16.68473,,,0.02515,17.31642,,,0.0498,,,,,,,,,,,,,,,,
2060.77456258,17.24646,,,0.03785,17.24646,,,0.03785,16.79245,,,0.02761,17.53663,,,0.06065,,,,,,,,,,,,,,,,
2060.79499468,17.48654,,,0.04538,17.48654,,,0.04538,17.03185,,,0.03309,18.15189,,,0.10274,,,,,,,,,,,,,,,,
2060.81542698,18.85904,,,0.15231,18.85904,,,0.15231,17.98809,,,0.07569,,,,,,,,,,,,,,,,,,,,
2060.83585918,17.82407,,,0.06195,17.82407,,,0.06195,17.31012,,,0.04277,19.44229,,,0.33737,,,,,,,,,,,,,,,,
2060.85629128,17.94693,,,0.06895,17.94693,,,0.06895,17.42632,,,0.04731,22.24424,,,4.42742,,,,,,,,,,,,,,,,
2060.87672358,,,,,,,,,,,,,,,,,,,,,,,,,,,,,,,,
2060.89715577,,,,,,,,,,,,,,,,,,,,,,,,,,,,,,,,
2060.91758807,,,,,,,,,,,,,,,,,,,,,,,,,,,,,,,,
2060.93802017,,,,,,,,,,,,,,,,,,,,,,,,,,,,,,,,
2060.95845236,,,,,,,,,,,,,,,,,,,,,,,,,,,,,,,,
2060.97888466,,,,,,,,,,,,,,,,,,,,,,,,,,,,,,,,
2060.99931675,,,,,,,,,,,,,,,,,,,,,,,,,,,,,,,,
2061.01974895,,,,,,,,,,,,,,,,,,,,,,,,,,,,,,,,
2061.04018124,,,,,,,,,,,,,,,,,,,,,,,,,,,,,,,,
2061.06061344,,,,,,,,,,,,,,,,,,,,,,,,,,,,,,,,
2061.08104553,,,,,,,,,,,,,,,,,,,,,,,,,,,,,,,,
2061.10147782,,,,,,,,,,,,,,,,,,,,,,,,,,,,,,,,
2061.12190991,,,,,,,,,,,,,,,,,,,,,,,,,,,,,,,,
2061.14234221,,,,,,,,,,,,,,,,,,,,,,,,,,,,,,,,
2061.1627744,,,,,,,,,,,,,,,,,,,,,,,,,,,,,,,,
2061.18320649,,,,,,,,,,,,,,,,,,,,,,,,,,,,,,,,
2061.20363878,,,,,,,,,,,,,,,,,,,,,,,,,,,,,,,,
2061.22407097,,,,,,,,,,,,,,,,,,,,,,,,,,,,,,,,
2061.24450306,,,,,,,,,,,,,,,,,,,,,,,,,,,,,,,,
2061.26493535,,,,,,,,,,,,,,,,,,,,,,,,,,,,,,,,
2061.44882503,,,,,,,,,18.40479,15.95066,15.773606730822332,0.08997,17.62704,15.99635,15.887580169556747,0.04878,17.20645,,,0.03665,16.98412,,,0.03283,16.92292,17.24188,16.753258265822577,0.03405,17.0666,17.41967,17.200376146691152,0.04229
2061.46925721,,,,,,,,,,,,,,,,,,,,,17.94793,,,0.07872,17.26047,16.76084,16.82509547268974,0.04589,17.22521,17.25237,17.271828311235307,0.04836
2061.4896895,,,,,,,,,,,,,,,,,,,,,18.22632,16.13613,16.136746793433545,0.09969,17.35957,16.80402,16.481698657086195,0.04928,17.27223,17.25622,17.24249095780726,0.0495
2061.51012158,,,,,,,,,,,,,,,,,,,,,17.87529,16.38066,16.4761467256028,0.07287,17.2317,16.91325,16.853850791809606,0.04424,17.1964,17.24908,17.211096809763234,0.04661
2061.53055376,,,,,,,,,,,,,,,,,,,,,18.03059,17.02062,17.008922905226036,0.08226,17.28102,16.94343,16.794888950294684,0.0453,17.21871,17.2501,17.170515976559955,0.04656
2061.55098605,,,,,,,,,,,,,,,,,19.25767,14.65515,14.718855114913211,0.23913,17.55137,16.55772,16.69478089118681,0.05467,17.05818,16.91169,17.0153941830072,0.03811,17.05745,17.14729,17.164006191229323,0.04146
2061.57141823,,,,,,,,,,,,,,,,,19.55639,15.61412,15.596030940288022,0.32232,17.59065,16.84938,16.96813776503915,0.05802,17.07387,16.88704,17.05168918041474,0.03958,17.06941,17.13455,17.444334579413788,0.04291
2061.59185031,,,,,,,,,,,,,,,,,18.10828,14.61579,14.652540034728284,0.08455,17.20524,16.48104,16.818019720768273,0.0405,16.84654,16.73942,17.00861457471673,0.03195,16.87665,16.96283,17.38651706999815,0.03575
2061.61228259,,,,,,,,,,,,,,,,,20.16999,17.07347,17.058259175438245,0.57679,17.64369,17.00828,17.155650387286517,0.06196,17.08831,16.9814,17.19625332444473,0.04079,17.06966,17.14879,17.19102946710131,0.04365
2061.63271477,,,,,,,,,,,,,,,,,,,,,18.15905,17.85577,17.86338961308857,0.09623,17.30431,16.98959,16.7848462118422,0.0481,17.21635,17.21369,17.249599728765215,0.04829
2061.65314685,,,,,,,,,,,,,,,,,20.73501,18.25789,18.242683777472287,0.95752,17.67041,17.2142,17.238679798459327,0.06265,17.09378,16.92115,16.987447835180415,0.04045,17.07163,17.11517,17.21359569978864,0.04315
2061.67357913,,,,,,,,,,,,,,,,,19.64255,17.42599,17.352423399845723,0.34824,17.5781,17.03023,16.99328718824639,0.05724,17.04901,16.95052,17.067790639430346,0.03861,17.03334,17.09935,17.214634133803003,0.04143
2061.69401131,,,,,,,,,,,,,,,,,,,,,18.01966,17.62818,17.727554621536846,0.08929,17.25335,17.03731,17.06624873925376,0.04841,17.19019,17.2091,17.108998258330686,0.04972
2061.71444349,,,,,,,,,,,,,,,,,,,,,18.94562,18.6204,18.673340608571657,0.21133,17.55921,17.27816,17.151050998592492,0.06473,17.39735,17.38908,17.060329585687107,0.06072
2061.73487567,,,,,,,,,,,,,,,,,,,,,,,,,17.91448,17.57868,17.357714988094056,0.08779,17.64572,17.61452,17.12731871569151,0.07463
2061.75530785,,,,,,,,,,,,,,,,,,,,,,,,,17.82733,17.53868,17.451787070482272,0.0794,17.54938,17.49513,17.265381577581717,0.06693
2061.77574003,,,,,,,,,,,,,,,,,,,,,,,,,17.92973,17.70053,17.557111510584047,0.08344,17.59167,17.51839,17.363569779781074,0.06655
2061.7961722,,,,,,,,,,,,,,,,,,,,,,,,,17.81386,17.55432,17.367805357881316,0.07922,17.51753,17.43888,17.247732119464995,0.06566
2061.81660438,,,,,,,,,,,,,,,,,,,,,,,,,17.88761,17.53951,17.314523272072496,0.0838,17.57488,17.49942,17.38109078303506,0.06841
2061.83703656,,,,,,,,,,,,,,,,,,,,,,,,,17.96371,17.63956,17.465124605442075,0.09005,17.60466,17.51388,17.301690817907282,0.07045
2061.85746873,,,,,,,,,,,,,,,,,,,,,,,,,18.17846,17.78422,17.46537602284524,0.11109,17.72986,17.63821,17.24158045647476,0.08003
2061.87790081,,,,,,,,,,,,,,,,,,,,,,,,,17.86406,17.40324,17.32036231091678,0.08315,17.56069,17.46708,17.24637127792266,0.06847
2061.89833308,,,,,,,,,,,,,,,,,,,,,,,,,17.92765,17.51777,17.43788934321965,0.0879,17.5786,17.46444,17.381255930650966,0.0694
2061.91876526,,,,,,,,,,,,,,,,,,,,,,,,,17.9828,17.48453,17.351620762426034,0.09656,17.61905,17.51651,17.40248746522531,0.07521
2061.93919743,,,,,,,,,,,,,,,,,,,,,,,,,18.13747,17.62736,17.537652595912412,0.10714,17.69329,17.56914,17.51307147888604,0.0775
2061.95962961,,,,,,,,,,,,,,,,,,,,,,,,,18.06584,17.70501,17.57000230289406,0.09365,17.61987,17.45846,17.387249878644706,0.06764
2061.98006178,,,,,,,,,,,,,,,,,,,,,,,,,18.03718,17.55997,17.33407465581288,0.09511,17.61606,17.46071,17.355715712891747,0.07028
2062.00049405,,,,,,,,,,,,,,,,,,,,,19.85373,19.31143,19.180338721740103,0.46445,17.66205,17.1045,17.095871488644335,0.06778,17.41889,17.26344,17.34648278283884,0.05899
2062.02092612,,,,,,,,,,,,,,,,,,,,,20.14925,19.66108,19.504553075409532,0.57827,17.61732,17.15913,17.154217822473267,0.0617,17.37192,17.18749,17.271563480044502,0.05359
2062.0413583,,,,,,,,,,,,,,,,,,,,,20.90264,20.38039,20.10080105252909,1.18926,17.67065,17.18021,17.295904307864618,0.06658,17.41164,17.21984,17.303902737943172,0.05711
2062.06179057,,,,,,,,,,,,,,,,,18.78774,17.80836,17.96460002024136,0.15031,17.28979,16.73678,16.824327321103,0.04164,16.80926,16.29352,16.768245639155403,0.02938,16.8118,16.61173,17.165274374391075,0.03205
2062.08222264,,,,,,,,,,,,,,,,,,,,,19.96203,19.38252,19.007045459171795,0.50371,17.6068,17.07765,17.11707236595694,0.06323,17.36927,17.15925,17.251065539669685,0.05532
2062.10265481,,,,,,,,,,,,,,,,,,,,,,,,,18.14929,17.64195,17.567831356643666,0.10071,17.66946,17.44384,17.369010558211315,0.0705
2062.12308708,,,,,,,,,,,,,,,,,,,,,,,,,18.41951,17.77917,17.83094250173135,0.13492,17.77769,17.56295,17.411872631598847,0.08137
2062.14351925,,,,,,,,,,,,,,,,,,,,,,,,,17.69919,17.09103,17.087746201540263,0.06996,17.38688,17.15589,17.265765314795182,0.05714
2062.16395132,,,,,,,,,,,,,,,,,,,,,,,,,17.97637,17.25722,17.324395780613326,0.0906,17.57951,17.35637,17.446756969836983,0.06845
2062.20481576,15.82121,16.09978,16.092182571863958,0.00841,15.82121,16.09978,16.092182571863958,0.00841,15.48163,15.74972,15.73044975360044,0.00682,15.42744,15.85249,15.715272853356804,0.00717,15.46288,16.06791,16.11818165353195,0.00818,15.60345,16.74443,16.835119486280036,0.0102,15.86594,17.05029,17.112857477673227,0.01423,16.22217,17.24859,17.335648185734353,0.02147
2062.22524782,15.95555,16.31554,16.291061022119404,0.00983,15.95555,16.31554,16.291061022119404,0.00983,15.5995,15.80306,15.797978810835287,0.00786,15.53399,15.88664,15.82125196406494,0.00818,15.55623,16.0576,16.03830815029846,0.00922,15.68229,16.84338,16.89002135525706,0.01136,15.92758,17.06546,16.9345953042071,0.01559,16.2721,17.26973,17.28678961095326,0.02328
2062.24568009,15.96856,16.28217,16.309023069132973,0.00991,15.96856,16.28217,16.309023069132973,0.00991,15.61027,15.81008,15.894171966420881,0.0079,15.54118,15.88805,15.905179106687026,0.00821,15.55869,16.0793,16.088762823854303,0.00921,15.67925,16.82489,16.854802231837112,0.01129,15.91787,17.02994,16.927579822235625,0.0154,16.25895,17.24686,17.250188479747223,0.02292
2062.26611226,15.96756,16.18718,16.22277557971438,0.00986,15.96756,16.18718,16.22277557971438,0.00986,15.60786,15.83139,15.890412828636693,0.00785,15.53999,15.90976,15.8386895771596,0.00816,15.55923,16.14762,16.169948518536412,0.00917,15.68174,16.81981,16.8501276905203,0.01126,15.92287,17.01906,16.92220801738095,0.0154,16.26365,17.25012,17.311536793471564,0.02291
2062.28654432,15.93665,16.04107,16.017238544114964,0.00955,15.93665,16.04107,16.017238544114964,0.00955,15.58147,15.84021,15.87218939418693,0.00763,15.51703,15.92201,15.819083488551282,0.00796,15.54039,16.21622,16.282909377791103,0.00897,15.66808,16.7998,16.645996703770678,0.01107,15.91554,17.00073,16.974909412202734,0.01522,16.261,17.24978,17.27092741265734,0.02275
2062.30697659,15.99788,16.10357,16.16022394049477,0.01,15.99788,16.10357,16.16022394049477,0.01,15.63495,15.86427,15.856682389005853,0.00794,15.56408,15.93665,15.895956248080362,0.00823,15.57969,16.21757,16.21988603560519,0.00921,15.69729,16.81632,16.887555543580664,0.01126,15.9317,16.98627,17.038753990964242,0.01531,16.26666,17.23919,17.32367381815361,0.02265
2062.32740876,15.91611,15.83447,15.822126445307962,0.00955,15.91611,15.83447,15.822126445307962,0.00955,15.56163,15.86627,15.89734254887658,0.00764,15.49482,15.94501,15.8180781304015,0.00795,15.51474,16.31175,16.339530834782654,0.00894,15.63949,16.75969,16.929203196412278,0.011,15.88313,16.94221,16.960714953168782,0.01507,16.22486,17.21219,17.249215705214134,0.02245
2062.34784102,16.12269,16.19052,16.26160409586406,0.01116,16.12269,16.19052,16.26160409586406,0.01116,15.74267,15.92576,15.932397864142809,0.00872,15.66333,15.98784,15.972452084022171,0.00898,15.67028,16.26039,16.259991910248395,0.00997,15.77844,16.84423,16.80819490080932,0.01209,16.00296,17.00448,16.869167019976008,0.01628,16.33434,17.28032,17.277350991641185,0.02402
2062.36827309,16.17167,16.29917,16.449866999950228,0.01164,16.17167,16.29917,16.449866999950228,0.01164,15.78723,15.87569,15.86449564908536,0.00906,15.69205,15.92693,15.96885278255611,0.00919,15.67792,16.1367,16.14758637599414,0.01002,15.75823,16.70101,16.664450204016084,0.01184,15.94603,16.90055,17.001132744056385,0.01541,16.24795,17.1636,17.25545623425957,0.02213
2062.38870525,16.25677,16.33557,16.354203795622094,0.0124,16.25677,16.33557,16.354203795622094,0.0124,15.85894,15.93677,15.875505882723303,0.00953,15.76298,15.98901,16.02409811362473,0.00966,15.75001,16.20908,16.216692865281303,0.01054,15.83245,16.7439,16.617796301834915,0.01248,16.02482,16.96055,16.99586754356156,0.01632,16.33176,17.2394,17.381124538423233,0.02355
2062.40913751,16.52831,16.63995,16.564673963782056,0.01609,16.52831,16.63995,16.564673963782056,0.01609,16.07716,16.02337,15.916044575737049,0.01178,15.95988,16.06172,15.989904148291975,0.01171,15.92822,16.23847,16.119884287914036,0.01257,15.99205,16.77568,16.558443094429567,0.01463,16.16428,17.08996,17.004107204049987,0.01879,16.45246,17.37171,17.32185280520773,0.02665
2062.42956958,16.60384,16.62179,16.589094146516313,0.01719,16.60384,16.62179,16.589094146516313,0.01719,16.13752,16.04389,15.924060368002122,0.01241,16.00677,16.05585,16.05518016573494,0.01219,15.95905,16.25899,16.1429383852285,0.01289,16.00394,16.8079,16.489674405115636,0.01475,16.15462,17.09706,16.884344142095628,0.01857,16.42588,17.37677,17.228790373675015,0.02593
2062.45000174,17.23221,17.15385,16.977927058013705,0.03012,17.23221,17.15385,16.977927058013705,0.03012,16.59525,16.4526,16.119537778913752,0.01859,16.44407,16.4314,16.18875132368252,0.01793,16.39268,16.67391,16.384927945540063,0.0189,16.44614,17.27163,16.737796897875075,0.02181,16.6239,17.58638,17.03466368476469,0.02816,16.92301,17.90857,17.499124902259048,0.04035
2062.4704339,16.5564,16.42457,16.413390247056125,0.01668,16.5564,16.42457,16.413390247056125,0.01668,16.09702,16.03341,15.9630048096939,0.01212,15.96277,16.04378,15.968784766291574,0.01186,15.91055,16.27323,16.165587455148618,0.01249,15.95183,16.77421,16.52579823014556,0.01425,16.09742,17.02634,16.982729403512714,0.01786,16.36542,17.31321,17.157845967321595,0.02485
2062.49086607,16.60547,16.38961,16.379275304919872,0.01756,16.60547,16.38961,16.379275304919872,0.01756,16.13535,16.05809,15.951703758814096,0.01264,15.99294,16.05542,16.042092629737613,0.01228,15.93212,16.30133,16.209823750728553,0.01283,15.96469,16.80468,16.703530448703045,0.01452,16.10071,17.03723,16.866091003497466,0.01803,16.362,17.32511,17.071355428940752,0.02495
2062.51129823,16.55164,16.2453,16.36606424392624,0.01608,16.55164,16.2453,16.36606424392624,0.01608,16.10024,15.98852,15.938084963737793,0.01177,15.95551,15.97539,15.903068192949112,0.01141,15.8883,16.24653,16.229817312500142,0.01185,15.90918,16.77139,16.760054839301105,0.01326,16.0298,16.98315,17.089721198101135,0.01625,16.27947,17.26884,17.259579071618848,0.02223
2062.53173039,15.97143,15.5668,16.246293117947847,0.00937,15.97143,15.5668,16.246293117947847,0.00937,15.63135,15.45926,16.058107005593516,0.0076,15.50575,15.45461,16.02944807952819,0.00749,15.44647,15.77287,16.30271243685762,0.00783,15.46806,16.35602,16.894010481544612,0.00877,15.57714,16.553,17.636649145967386,0.01062,15.81588,16.8384,17.54913582511162,0.01437
2062.55216255,15.93095,15.37345,16.122943726782974,0.00906,15.93095,15.37345,16.122943726782974,0.00906,15.6019,15.3166,16.04584285942775,0.00742,15.47612,15.3297,16.038174661697482,0.00731,15.41379,15.69956,16.37398649445591,0.00762,15.42951,16.17776,16.84598660189941,0.00849,15.53091,16.36592,17.41750151989759,0.0102,15.76264,16.62104,17.501915943911463,0.01372
2062.57259471,16.86491,16.31791,16.256686049305532,0.02169,16.86491,16.31791,16.256686049305532,0.02169,16.3277,16.19611,16.099321453589567,0.01467,16.15394,16.1504,16.02305883416619,0.01386,16.0633,16.44854,16.406355659643815,0.01409,16.06643,16.98362,16.89963629313216,0.01552,16.17186,17.14494,17.00033274254261,0.01875,16.40399,17.42392,17.329991593930455,0.02525
2062.59302687,16.73345,16.10716,15.990091221120707,0.01903,16.73345,16.10716,15.990091221120707,0.01903,16.23943,16.10009,16.007717687310578,0.0134,16.07498,16.06349,15.982026456955676,0.01276,15.98974,16.3813,16.32363339531753,0.01304,15.99318,16.93016,16.919591816599212,0.01436,16.09586,17.07534,17.062471604080237,0.01731,16.32758,17.35546,17.260508293565795,0.0233
2062.61345903,17.01081,15.90636,15.991554056425324,0.02431,17.01081,15.90636,15.991554056425324,0.02431,16.44164,15.81196,15.827748050552083,0.01597,16.23632,15.88048,15.820667453716194,0.01465,16.11289,16.34111,16.4293520994758,0.01446,16.07836,16.63291,16.83326780009587,0.01539,16.14422,16.81313,17.011960673989044,0.01792,16.34961,17.01301,17.07783586922132,0.02355
2062.63389119,19.38288,17.6534,17.44084908009718,0.20948,19.38288,17.6534,17.44084908009718,0.20948,17.5376,16.28673,16.04923580973721,0.0425,17.14668,16.39922,16.313593600717436,0.03289,16.90685,16.96032,16.798212537039856,0.02918,16.78236,16.96578,16.777919845737184,0.02859,16.79035,17.19983,16.81373227961114,0.0316,16.96047,17.32105,16.870618043711907,0.04022
2062.65432345,25.38818,23.5215,23.262922010463633,53.80882,25.38818,23.5215,23.262922010463633,53.80882,17.77333,16.45548,16.202798457012094,0.05374,17.29566,16.51298,16.376545263489426,0.0384,17.0127,17.06031,16.897627887255524,0.03274,16.86881,17.02729,16.926615126947038,0.03152,16.86809,17.25315,16.883479768854674,0.03456,17.04185,17.37121,16.976059181561332,0.04413
2062.6747555,17.03302,15.88241,15.73742580616768,0.0245,17.03302,15.88241,15.73742580616768,0.0245,16.45484,16.04104,16.022351053439962,0.01596,16.25273,16.05738,15.999382842788192,0.01469,16.13455,16.47118,16.396778879911945,0.01457,16.1066,16.84308,17.01589138822109,0.01559,16.17973,16.94822,17.01176168037797,0.01829,16.38953,17.16005,17.062525954545674,0.02413
2062.69518776,,,,,,,,,17.83475,16.69564,16.440610669600233,0.05677,17.34806,16.69012,16.480129564538064,0.04023,17.06267,17.18705,16.994350444248628,0.03423,16.91734,17.21275,16.980329234920976,0.03291,16.91731,17.37725,17.109653218950807,0.0361,17.08752,17.49615,16.972558573173828,0.04595
2062.71561992,17.85581,15.79565,15.67758343761269,0.05091,17.85581,15.79565,15.67758343761269,0.05091,16.96051,15.67772,15.523410492566834,0.02477,16.65691,15.91552,15.832260581897408,0.02077,16.46067,16.55337,16.517436734075975,0.01918,16.36408,16.59087,16.69412450685173,0.01928,16.38009,16.78819,16.814937205191338,0.02146,16.5534,16.89733,16.96413053436834,0.02739
2062.73605198,20.02587,17.36563,17.350235639213285,0.36936,20.02587,17.36563,17.350235639213285,0.36936,17.62156,15.5026,15.59342467020698,0.04479,17.12716,15.76963,15.837559403369355,0.03152,16.81652,16.29192,16.281024484897905,0.0262,16.63733,16.31771,16.65068683609916,0.02442,16.59299,16.63466,16.85055886224174,0.02572,16.73208,16.88108,17.06525599543491,0.0318
2062.75648423,,,,,,,,,17.77853,15.66254,15.737334749627504,0.05258,17.21994,15.84889,15.94872759068436,0.03488,16.87876,16.29467,16.258486771715386,0.02819,16.68334,16.34952,16.63264538813029,0.02588,16.62909,16.65333,16.89376629014562,0.02701,16.76351,16.90543,17.042440018644434,0.03327
2062.77691639,,,,,,,,,,,,,,,,,,,,,18.29538,17.23336,17.434906676506497,0.11191,17.64028,17.37446,17.256329411392578,0.0672,17.55247,17.58651,17.395909018108952,0.06748
2062.79734844,,,,,,,,,,,,,,,,,,,,,18.57044,17.13567,17.152019263718472,0.14379,17.67511,17.44527,17.312485341888365,0.06922,17.53799,17.5968,17.459995642628105,0.06642
2062.8177807,,,,,,,,,,,,,,,,,18.70376,18.05711,18.036962909320998,0.14337,17.53318,16.04656,16.099101794469224,0.05367,17.11402,16.89626,16.912613174313563,0.04005,17.09192,17.15732,17.238443263529977,0.04272
2062.83821285,,,,,,,,,,,,,,,,,,,,,18.33911,16.59835,16.72840522597281,0.11776,17.47996,17.21575,17.11408820196861,0.05862,17.34912,17.40101,17.29924318709952,0.05657
2062.85864491,,,,,,,,,,,,,,,,,,,,,18.79896,17.52168,17.55706790287105,0.17192,17.56487,17.02589,16.96099292170707,0.0606,17.38208,17.32956,17.265909254952472,0.05575
2062.87907716,,,,,,,,,,,,,,,,,,,,,20.95508,20.12004,19.87967050679236,1.2388,17.79066,16.97967,16.992274383104558,0.0738,17.49179,17.33873,17.215236936028532,0.06103
2062.89950931,,,,,,,,,,,,,,,,,,,,,18.29559,17.48684,17.452526874268383,0.10689,17.33278,16.52311,16.717649453733895,0.04837,17.18868,17.03633,17.038128599176602,0.04612
2062.91994137,,,,,,,,,,,,,,,,,,,,,,,,,17.95648,17.00602,16.770788273706593,0.0882,17.55821,17.35517,17.206938669314376,0.06656
2062.94037362,,,,,,,,,,,,,,,,,,,,,,,,,18.00652,17.20788,17.174215153437057,0.09014,17.55194,17.32606,17.30683010670571,0.06459
2062.96080577,,,,,,,,,,,,,,,,,,,,,21.44827,21.12257,21.15922799609161,1.76501,17.58944,16.95762,16.859856762509413,0.0555,17.29813,17.04834,17.25416692913039,0.04621
2062.98123792,,,,,,,,,,,,,,,,,,,,,,,,,17.59884,17.00538,16.840666817356457,0.06016,17.29685,17.04474,17.29169232783097,0.0496
2063.00167007,,,,,,,,,,,,,,,,,,,,,,,,,18.05073,17.52347,17.34901686938405,0.09205,17.53312,17.27032,17.41949435130673,0.06224
2063.02210222,,,,,,,,,,,,,,,,,,,,,,,,,,,,,18.59098,18.25969,17.8312773512783,0.15052
2063.04253437,,,,,,,,,,,,,,,,,,,,,,,,,,,,,18.46808,18.02363,17.665415723185124,0.1363
2063.06296652,,,,,,,,,,,,,,,,,,,,,,,,,,,,,18.61162,18.23222,17.724667413161693,0.15562
2063.08339867,,,,,,,,,,,,,,,,,,,,,,,,,,,,,18.51182,18.02651,17.707371868163882,0.1416
2063.10383092,,,,,,,,,,,,,,,,,,,,,,,,,,,,,18.33934,17.90824,17.595499866268483,0.12359
2063.12426307,,,,,,,,,,,,,,,,,,,,,,,,,19.94351,20.46318,20.077464201856692,0.46337,18.00542,17.27785,17.03915119473995,0.08472
2063.14469512,,,,,,,,,,,,,,,,,,,,,,,,,20.76282,21.26547,21.205094348674578,0.93881,18.03139,17.16639,16.92703704594859,0.08267
2063.16512736,,,,,,,,,,,,,,,,,,,,,,,,,,,,,,,,
2063.18555951,,,,,,,,,,,,,,,,,,,,,,,,,,,,,19.8139,18.72271,18.53562143393877,0.4486
2063.20599156,,,,,,,,,,,,,,,,,,,,,,,,,,,,,18.85018,17.72553,17.514743399206818,0.18565
2063.2264238,,,,,,,,,,,,,,,,,,,,,,,,,18.57109,18.20537,18.395552377558424,0.12662,17.65664,16.50883,16.732298183315617,0.05942
2063.24685585,,,,,,,,,,,,,,,,,,,,,,,,,18.17206,17.44379,17.68106842713786,0.08813,17.50826,16.6324,16.886383442352148,0.0521
2063.26728799,,,,,,,,,,,,,,,,,,,,,,,,,17.56257,16.88309,17.313010878010004,0.05,17.21759,16.28584,16.85045990422068,0.03963
2063.28772024,,,,,,,,,,,,,,,,,,,,,,,,,17.43935,16.46737,16.820199500010805,0.04387,17.11724,16.50198,16.977734156856194,0.03551