KBJD,raw_ap_chosen,post_decorr_ap_chosen,final_ap_chosen,err_ap_chosen,raw_ap_0,post_decorr_ap_0,final_ap_0,err_ap_0,raw_ap_1,post_decorr_ap_1,final_ap_1,err_ap_1,raw_ap_2,post_decorr_ap_2,final_ap_2,err_ap_2,raw_ap_3,post_decorr_ap_3,final_ap_3,err_ap_3,raw_ap_4,post_decorr_ap_4,final_ap_4,err_ap_4,raw_ap_5,post_decorr_ap_5,final_ap_5,err_ap_5,raw_ap_6,post_decorr_ap_6,final_ap_6,err_ap_6
2060.28419413,,,,,,,,,,,,,,,,,,,,,,,,,,,,,,,,
2060.30462644,,,,,,,,,,,,,,,,,,,,,,,,,,,,,,,,
2060.32505865,,,,,,,,,,,,,,,,,,,,,,,,,,,,,,,,
2060.34549076,,,,,,,,,,,,,,,,,,,,,,,,,,,,,,,,
2060.36592308,,,,,,,,,,,,,,,,,,,,,,,,,,,,,,,,
2060.38635529,,,,,,,,,,,,,,,,,,,,,,,,,,,,,,,,
2060.4067875,,,,,,,,,,,,,,,,,,,,,,,,,,,,,,,,
2060.42721971,,,,,,,,,,,,,,,,,,,,,,,,,,,,,,,,
2060.44765191,,,,,,,,,,,,,,,,,,,,,,,,,,,,,,,,
2060.46808412,,,,,,,,,,,,,,,,,,,,,,,,,,,,,,,,
2060.48851633,,,,,,,,,,,,,,,,,,,,,,,,,,,,,,,,
2060.50894854,,,,,,,,,,,,,,,,,,,,,,,,,,,,,,,,
2060.52938075,,,,,,,,,,,,,,,,,,,,,,,,,,,,,,,,
2060.54981295,,,,,,,,,,,,,,,,,,,,,,,,,,,,,,,,
2060.57024516,,,,,,,,,,,,,,,,,,,,,,,,,,,,,,,,
2060.59067747,,,,,,,,,,,,,,,,,,,,,,,,,,,,,,,,
2060.61110957,,,,,,,,,,,,,,,,,,,,,,,,,,,,,,,,
2060.63154178,,,,,,,,,,,,,,,,,,,,,,,,,,,,,,,,
2060.65197408,,,,,,,,,,,,,,,,,,,,,,,,,,,,,,,,
2060.67240618,,,,,,,,,,,,,,,,,,,,,,,,,,,,,,,,
2060.69283849,,,,,,,,,,,,,,,,,,,,,,,,,,,,,,,,
2060.71327069,,,,,,,,,,,,,,,,,,,,,,,,,,,,,,,,
2060.73370279,,,,,,,,,,,,,,,,,,,,,,,,,,,,,,,,
2060.7541351,,,,,,,,,,,,,,,,,,,,,,,,,,,,,,,,
2060.7745673,,,,,,,,,,,,,,,,,,,,,,,,,,,,,,,,
2060.7949994,,,,,,,,,,,,,,,,,,,,,,,,,,,,,,,,
2060.8154317,,,,,,,,,,,,,,,,,,,,,,,,,,,,,,,,
2060.8358639,,,,,,,,,,,,,,,,,,,,,,,,,,,,,,,,
2060.856296,,,,,,,,,,,,,,,,,,,,,,,,,,,,,,,,
2060.8767283,,,,,,,,,,,,,,,,,,,,,,,,,,,,,,,,
2060.8971605,,,,,,,,,,,,,,,,,,,,,,,,,,,,,,,,
2060.9175928,,,,,,,,,,,,,,,,,,,,,,,,,,,,,,,,
2060.93802489,,,,,,,,,,,,,,,,,,,,,,,,,,,,,,,,
2060.95845709,,,,,,,,,,,,,,,,,,,,,,,,,,,,,,,,
2060.97888939,,,,,,,,,,,,,,,,,,,,,,,,,,,,,,,,
2060.99932149,,,,,,,,,,,,,,,,,,,,,,,,,,,,,,,,
2061.01975368,,,,,,,,,,,,,,,,,,,,,,,,,,,,,,,,
2061.04018598,,,,,,,,,,,,,,,,,,,,,,,,,,,,,,,,
2061.06061817,,,,,,,,,,,,,,,,,,,,,,,,,,,,,,,,
2061.08105027,,,,,,,,,,,,,,,,,,,,,,,,,,,,,,,,
2061.10148256,,,,,,,,,,,,,,,,,,,,,,,,,,,,,,,,
2061.12191466,,,,,,,,,,,,,,,,,,,,,,,,,,,,,,,,
2061.14234695,,,,,,,,,,,,,,,,,,,,,,,,,,,,,,,,
2061.16277914,,,,,,,,,,,,,,,,,,,,,,,,,,,,,,,,
2061.18321124,,,,,,,,,,,,,,,,,,,,,,,,,,,,,,,,
2061.20364353,,,,,,,,,,,,,,,,,,,,,,,,,,,,,,,,
2061.22407572,,,,,,,,,,,,,,,,,,,,,,,,,,,,,,,,
2061.24450781,,,,,,,,,,,,,,,,,,,,,,,,,,,,,,,,
2061.2649401,,,,,,,,,,,,,,,,,,,,,,,,,,,,,,,,
2061.4488298,17.08737,16.26751,16.043272935639543,0.05891,,,,,17.08737,16.26751,16.043272935639543,0.05891,17.05366,16.80236,16.985146243253297,0.06331,17.6666,17.25999,17.170488654556415,0.12314,,,,,,,,,,,,
2061.46926198,,,,,,,,,,,,,,,,,,,,,,,,,,,,,,,,
2061.48969427,,,,,,,,,,,,,,,,,,,,,,,,,,,,,,,,
2061.51012635,,,,,,,,,,,,,,,,,,,,,,,,,,,,,,,,
2061.53055854,,,,,,,,,,,,,,,,,,,,,,,,,,,,,,,,
2061.55099082,,,,,,,,,,,,,,,,,,,,,,,,,,,,,,,,
2061.57142301,,,,,,,,,,,,,,,,,,,,,,,,,,,,,,,,
2061.59185509,,,,,,,,,,,,,,,,,,,,,,,,,,,,,,,,
2061.61228737,,,,,,,,,,,,,,,,,,,,,,,,,,,,,,,,
2061.63271956,,,,,,,,,,,,,,,,,,,,,,,,,,,,,,,,
2061.65315164,,,,,,,,,,,,,,,,,,,,,,,,,,,,,,,,
2061.67358392,,,,,,,,,,,,,,,,,,,,,,,,,,,,,,,,
2061.6940161,,,,,,,,,,,,,,,,,,,,,,,,,,,,,,,,
2061.71444828,,,,,,,,,,,,,,,,,,,,,,,,,,,,,,,,
2061.73488046,,,,,,,,,,,,,,,,,,,,,,,,,,,,,,,,
2061.75531264,,,,,,,,,,,,,,,,,,,,,,,,,,,,,,,,
2061.77574482,,,,,,,,,,,,,,,,,,,,,,,,,,,,,,,,
2061.796177,,,,,,,,,,,,,,,,,,,,,,,,,,,,,,,,
2061.81660918,,,,,,,,,,,,,,,,,,,,,,,,,,,,,,,,
2061.83704136,,,,,,,,,,,,,,,,,,,,,,,,,,,,,,,,
2061.85747353,,,,,,,,,,,,,,,,,,,,,,,,,,,,,,,,
2061.87790561,,,,,,,,,,,,,,,,,,,,,,,,,,,,,,,,
2061.89833789,,,,,,,,,,,,,,,,,,,,,,,,,,,,,,,,
2061.91877007,,,,,,,,,,,,,,,,,,,,,,,,,,,,,,,,
2061.93920224,,,,,,,,,,,,,,,,,,,,,,,,,,,,,,,,
2061.95963442,,,,,,,,,,,,,,,,,,,,,,,,,,,,,,,,
2061.98006659,,,,,,,,,,,,,,,,,,,,,,,,,,,,,,,,
2062.00049887,,,,,,,,,,,,,,,,,,,,,,,,,,,,,,,,
2062.02093094,,,,,,,,,,,,,,,,,,,,,,,,,,,,,,,,
2062.04136311,,,,,,,,,,,,,,,,,,,,,,,,,,,,,,,,
2062.06179539,,,,,,,,,,,,,,,,,,,,,,,,,,,,,,,,
2062.08222746,,,,,,,,,,,,,,,,,,,,,,,,,,,,,,,,
2062.10265963,,,,,,,,,,,,,,,,,,,,,,,,,,,,,,,,
2062.1230919,,,,,,,,,,,,,,,,,,,,,,,,,,,,,,,,
2062.14352407,,,,,,,,,,,,,,,,,,,,,,,,,,,,,,,,
2062.16395614,,,,,,,,,,,,,,,,,,,,,,,,,,,,,,,,
2062.20482059,15.19345,16.01885,16.068382400155986,0.01155,,,,,15.19345,16.01885,16.068382400155986,0.01155,15.23343,16.32116,16.435510647985602,0.01328,15.58198,16.47514,16.63975654139614,0.02023,16.42803,15.69635,15.500028970045454,0.04842,,,,,,,,
2062.22525265,15.34139,16.19226,16.1780083013491,0.013,,,,,15.34139,16.19226,16.1780083013491,0.013,15.37802,16.55602,16.46340187277516,0.01489,15.75978,17.02596,16.667547300767943,0.02339,16.7846,17.04517,16.882969551641033,0.06601,,,,,,,,
2062.24568492,15.34821,16.20925,16.371056342198877,0.0132,,,,,15.34821,16.20925,16.371056342198877,0.0132,15.37526,16.57552,16.554082941592792,0.015,15.74096,17.05764,16.775125097752976,0.02321,16.70535,17.02974,16.911072092297047,0.06196,,,,,,,,
2062.26611709,15.32199,16.18916,16.191683295494666,0.01312,,,,,15.32199,16.18916,16.191683295494666,0.01312,15.35354,16.5605,16.46109550059374,0.01496,15.72431,17.03482,16.85565633067761,0.02327,16.69569,16.96958,16.86246761117276,0.06252,,,,,,,,
2062.28654916,15.31414,16.1846,16.25155452862364,0.01274,,,,,15.31414,16.1846,16.25155452862364,0.01274,15.34288,16.54607,16.6579137949649,0.01449,15.705,16.96887,16.934581332166587,0.02236,16.64411,16.78183,16.788561641984263,0.05831,,,,,,,,
2062.30698143,15.31513,16.19707,16.141403487445583,0.0127,,,,,15.31513,16.19707,16.141403487445583,0.0127,15.33541,16.57229,16.5776276502331,0.01434,15.67996,17.03877,17.05834955154985,0.02176,16.54882,16.84618,16.78834793258477,0.0532,,,,,,,,
2062.3274136,15.26802,16.14751,16.077054564159067,0.01243,,,,,15.26802,16.14751,16.077054564159067,0.01243,15.29429,16.50587,16.670307454691553,0.01411,15.63344,16.86241,17.114465153785993,0.02132,16.46627,16.44899,16.38442911382273,0.05041,,,,,,,,
2062.34784586,15.42301,16.32345,16.3591082738286,0.01426,,,,,15.42301,16.32345,16.3591082738286,0.01426,15.43799,16.72714,16.655942397209852,0.01602,15.8016,17.27881,17.106517245915146,0.02475,16.78023,17.23288,17.11258046638523,0.06694,,,,,,,,
2062.36827793,15.42099,16.33314,16.44298715184326,0.01417,,,,,15.42099,16.33314,16.44298715184326,0.01417,15.39718,16.72438,16.712518844184235,0.01536,15.68376,17.23886,17.169608348083557,0.02211,16.39454,16.95369,16.932628250174446,0.04672,,,,,,,,
2062.38871009,15.47538,16.39272,16.2798354589916,0.01474,,,,,15.47538,16.39272,16.2798354589916,0.01474,15.45921,16.79936,16.70407553489833,0.01609,15.77484,17.34397,17.165369234146166,0.02379,16.59336,17.14723,17.13823283650422,0.05552,,,,,,,,
2062.40914236,15.5076,16.38204,16.191249231149165,0.01547,,,,,15.5076,16.38204,16.191249231149165,0.01547,15.47057,16.78303,16.488158357496033,0.01657,15.7533,17.29388,17.021751532190645,0.02377,16.46978,17.08095,16.76816814078014,0.0505,,,,,,,,
2062.42957442,15.57377,16.35372,16.148538018741828,0.01642,,,,,15.57377,16.35372,16.148538018741828,0.01642,15.51591,16.74159,16.4555869713255,0.01726,15.78028,17.22165,17.027698568867716,0.02434,16.46387,17.11993,17.044687453735182,0.05017,,,,,,,,
2062.45000659,16.05508,16.75271,16.3953852169489,0.02538,,,,,16.05508,16.75271,16.3953852169489,0.02538,16.05497,17.20648,16.472723754026603,0.02813,16.64289,17.99655,17.146835107227542,0.05344,,,,,,,,,,,,
2062.47043875,15.52096,16.31702,16.27346660807463,0.01584,,,,,15.52096,16.31702,16.27346660807463,0.01584,15.45425,16.70766,16.488097797832246,0.01651,15.68566,17.15162,17.107648858329302,0.02259,16.2608,16.88178,16.7036594825976,0.04215,18.38193,16.85134,16.841700752746736,0.32609,,,,
2062.49087092,15.52993,16.29054,16.143817970002075,0.0159,,,,,15.52993,16.29054,16.143817970002075,0.0159,15.45664,16.68153,16.518079418169364,0.01648,15.67406,17.10447,16.893177701494487,0.02225,16.21173,16.84062,16.68882988899109,0.0401,17.91248,16.71888,16.62614383920555,0.21067,,,,
2062.51130308,15.52626,16.20351,16.02043645292064,0.01551,,,,,15.52626,16.20351,16.02043645292064,0.01551,15.44275,16.5928,16.602017641815124,0.01592,15.63745,16.97844,17.186586615967197,0.02106,16.11919,16.78122,16.82522048206873,0.03605,17.40559,16.278,16.305001171180095,0.12928,,,,
2062.53173524,14.92176,15.6016,16.158333464131697,0.00913,,,,,14.92176,15.6016,16.158333464131697,0.00913,14.81053,15.96923,16.759211475013974,0.00913,14.86924,16.21649,17.40085633860446,0.01065,15.03786,15.68626,16.320830194123122,0.01366,15.30803,14.55302,14.818157132379543,0.01922,15.66118,15.98347,16.110650899595758,0.02895
2062.55216741,14.93,15.49014,16.305840262315478,0.00898,,,,,14.93,15.49014,16.305840262315478,0.00898,14.81128,15.86093,16.74155443814557,0.00892,14.85944,16.07377,17.36056585097178,0.0103,15.01391,15.71011,16.368812061007826,0.01305,15.26121,14.33129,14.403604110301155,0.01797,15.58151,15.6919,15.89850588833997,0.02626
2062.57259957,15.65351,16.25985,16.18165145394217,0.01811,,,,,15.65351,16.25985,16.18165145394217,0.01811,15.56584,16.6659,16.522700726925198,0.01852,15.77952,17.05012,17.044631153054887,0.02493,16.31827,16.98044,16.824967006664675,0.04498,18.02691,17.58173,17.499140915826064,0.23806,,,,
2062.59303173,15.638,16.21735,16.147962229596516,0.0172,,,,,15.638,16.21735,16.147962229596516,0.0172,15.55225,16.63247,16.681234754799906,0.01762,15.76056,17.00347,17.018097411819127,0.02359,16.28125,16.94522,16.79032132462191,0.04187,17.82841,17.5384,17.57143793068346,0.19093,,,,
2062.61346389,15.72512,16.15238,16.169618440474057,0.0185,,,,,15.72512,16.15238,16.169618440474057,0.0185,15.61442,16.51874,16.62276982189576,0.01852,15.79176,16.83375,16.886420290797535,0.02411,16.24394,16.78004,16.63496080353218,0.04016,17.36202,16.36283,16.362796187463058,0.12337,,,,
2062.63389605,16.6528,16.94736,16.763914027608614,0.04169,,,,,16.6528,16.94736,16.763914027608614,0.04169,16.58039,17.33221,16.854081020938054,0.04324,17.25924,18.12972,17.442332046618418,0.08935,,,,,,,,,,,,
2062.65432831,16.89483,17.17487,16.770521915565016,0.05431,,,,,16.89483,17.17487,16.770521915565016,0.05431,16.83518,17.57708,17.133710321525214,0.057,17.77261,18.62845,17.63056239009966,0.14947,,,,,,,,,,,,
2062.67476037,15.79994,16.25845,16.147906598708797,0.0198,,,,,15.79994,16.25845,16.147906598708797,0.0198,15.70495,16.66865,16.62380786648557,0.02011,15.9272,17.02352,16.880066509404983,0.02728,16.49755,17.04314,17.002625330119123,0.05067,18.54452,18.44624,18.360280993098783,0.36622,,,,
2062.69519263,16.98284,17.29147,16.94597821307512,0.06015,,,,,16.98284,17.29147,16.94597821307512,0.06015,16.938,17.72267,17.19210423129003,0.06399,18.14327,19.04014,18.187180717613092,0.21475,,,,,,,,,,,,
2062.71562479,15.95535,16.2574,16.113740111962784,0.02225,,,,,15.95535,16.2574,16.113740111962784,0.02225,15.82172,16.60463,16.65477973004415,0.02181,16.00502,16.89657,16.675559648081336,0.02856,16.51306,16.86269,16.79750673270697,0.05009,18.05276,17.08039,17.181376836863002,0.22689,,,,
2062.73605685,15.63659,15.90974,16.156155203104294,0.01644,,,,,15.63659,15.90974,16.156155203104294,0.01644,15.49384,16.25064,16.6999936011394,0.01598,15.59339,16.45235,17.406055120866284,0.01936,15.87987,16.1922,16.46194156143807,0.02769,16.42043,15.3977,15.4805881619175,0.04996,17.08696,16.41291,16.477180443587695,0.10047
2062.7564891,15.66254,15.92227,16.339066370173544,0.01723,,,,,15.66254,15.92227,16.339066370173544,0.01723,15.51724,16.26495,16.826153410915424,0.01671,15.6143,16.45976,17.240478681786417,0.0202,15.89611,16.18917,16.59476106683292,0.02877,16.42571,15.46494,15.520069382672732,0.05141,17.06068,16.33108,16.389342122591447,0.10042
2062.77692126,16.72762,16.19986,16.41038485673741,0.04427,,,,,16.72762,16.19986,16.41038485673741,0.04427,16.50543,16.79107,17.009018695437398,0.04,16.78118,16.94562,17.510923763029883,0.05703,17.75364,16.3342,16.555519629656633,0.15347,,,,,,,,
2062.79735332,16.8308,15.6946,15.894536017005583,0.04792,,,,,16.8308,15.6946,15.894536017005583,0.04792,16.53639,16.52854,16.713042809758246,0.04052,16.72714,16.4086,17.114889191328036,0.05342,17.42148,14.26605,14.571717645148855,0.11127,,,,,,,,
2062.81778558,18.29916,17.92927,17.891857191864464,0.17893,,,,,18.29916,17.92927,17.891857191864464,0.17893,17.4752,17.43046,17.460564742129375,0.09292,17.79448,17.76496,17.664553926374804,0.13792,22.67214,21.3752,21.53805642563579,13.54217,,,,,,,,
2062.83821773,,,,,,,,,,,,,,,,,,,,,,,,,,,,,,,,
2062.85864979,,,,,,,,,,,,,,,,,,,,,,,,,,,,,,,,
2062.87908204,,,,,,,,,,,,,,,,,,,,,,,,,,,,,,,,
2062.8995142,,,,,,,,,,,,,19.43352,19.70305,19.61405626711736,0.56112,18.60734,19.32794,19.2511381303147,0.29008,19.44819,19.26751,19.275282100434495,0.69174,,,,,,,,
2062.91994625,,,,,,,,,,,,,,,,,,,,,,,,,,,,,,,,
2062.94037851,,,,,,,,,,,,,,,,,,,,,,,,,,,,,,,,
2062.96081066,,,,,,,,,,,,,,,,,20.07084,21.22199,21.07321351296074,1.03956,18.48926,17.19537,17.284386138503486,0.26631,18.16277,16.63865,16.66719194983128,0.21638,17.67224,16.94175,16.91513761254286,0.14996
2062.98124281,,,,,,,,,,,,,,,,,19.42618,20.59921,20.089833667669257,0.5912,18.26955,17.28801,17.185847826341796,0.224,17.95265,16.52479,16.406010653610423,0.18362,17.50313,16.76907,16.761991934561586,0.13216
2063.00167496,,,,,,,,,,,,,,,,,,,,,,,,,22.13184,20.80433,20.723703506337205,8.82408,18.34864,17.62379,17.651182150705644,0.29471
2063.02210712,,,,,,,,,,,,,,,,,,,,,,,,,,,,,,,,
2063.04253927,,,,,,,,,,,,,,,,,,,,,,,,,,,,,,,,
2063.06297142,,,,,,,,,,,,,,,,,,,,,,,,,,,,,,,,
2063.08340357,,,,,,,,,,,,,,,,,,,,,,,,,,,,,,,,
2063.10383582,,,,,,,,,,,,,,,,,,,,,,,,,,,,,,,,
2063.12426797,,,,,,,,,,,,,,,,,,,,,,,,,,,,,18.57175,17.94967,18.047995435465403,0.32304
2063.14470002,,,,,,,,,,,,,,,,,,,,,,,,,,,,,18.08924,17.49243,17.63301238305528,0.20756
2063.16513227,,,,,,,,,,,,,,,,,,,,,,,,,,,,,,,,
2063.18556442,,,,,,,,,,,,,,,,,,,,,,,,,,,,,,,,
2063.20599647,,,,,,,,,,,,,,,,,,,,,,,,,,,,,,,,
2063.22642871,,,,,,,,,,,,,,,,,,,,,,,,,,,,,,,,
2063.24686076,,,,,,,,,,,,,,,,,,,,,,,,,,,,,,,,
2063.26729291,,,,,,,,,,,,,,,,,,,,,,,,,,,,,,,,
2063.28772515,,,,,,,,,,,,,,,,,,,,,,,,,,,,,,,,
2063.3081572,,,,,,,,,,,,,,,,,,,,,,,,,,,,,,,,
2063.32858935,,,,,,,,,,,,,,,,,,,,,,,,,,,,,,,,
2063.34902159,,,,,,,,,,,,,,,,,,,,,,,,,,,,,,,,
2063.36945363,,,,,,,,,,,,,,,,,,,,,,,,,,,,,,,,
2063.38988578,,,,,,,,,,,,,,,,,,,,,,,,,,,,,,,,
2063.41031802,,,,,,,,,,,,,,,,,,,,,17.75252,16.92837,17.088569827631463,0.10772,16.70687,16.054,16.068231223320932,0.04515,16.28622,15.22226,15.397515364733103,0.03338
2063.43075007,,,,,,,,,,,,,,,,,,,,,17.4381,16.63729,16.7868161458028,0.07975,16.56903,15.94258,15.932442564439423,0.03933,16.18808,15.63062,15.700594203653678,0.03016
2063.45118221,,,,,,,,,,,,,,,,,,,,,18.35549,17.56685,17.537280110489927,0.19569,16.85949,16.25025,16.18838054873711,0.05418,16.34334,15.85445,15.897696151859916,0.03668
2063.47161445,,,,,,,,,,,,,,,,,,,,,17.62886,16.85832,16.90522788407595,0.0957,16.61203,16.02183,16.013932221664568,0.0412,16.19704,15.97674,15.980420859014478,0.03061
2063.49204659,,,,,,,,,,,,,,,,,,,,,17.58454,16.82595,16.905968301050702,0.09376,16.60995,16.0329,15.988787593687789,0.04196,16.20132,16.02934,15.975278742527713,0.03136
2063.51247873,,,,,,,,,,,,,,,,,,,,,17.25407,16.59255,16.451604378167364,0.06562,16.46742,16.01082,15.955706322485367,0.03492,16.11253,15.99271,15.986763054244692,0.02742
2063.53291088,,,,,,,,,,,,,,,,,20.66506,20.83162,20.509219319699767,1.43333,17.26735,16.58723,16.516243760744473,0.06898,16.50485,16.03289,16.023343140326364,0.03753,16.13318,16.01932,16.048900885859275,0.02902
2063.55334302,,,,,,,,,,,,,,,,,18.91052,19.23676,18.945762737143525,0.26905,17.12582,16.53952,16.44388330379737,0.0572,16.45488,16.0575,16.039500290704183,0.03386,16.11551,16.03639,16.067808629910555,0.02697
2063.57377516,,,,,,,,,,,,,19.62309,18.97927,18.840939172183315,0.42144,17.28614,17.62458,17.5854337873778,0.05424,16.59031,16.15318,16.32613251388744,0.03144,16.16081,15.87867,15.949733101160973,0.02324,15.93038,15.89826,16.017445367116423,0.02047
2063.5942073,,,,,,,,,,,,,18.13957,17.35106,17.21102570345026,0.09769,16.98604,17.22833,16.99891096406562,0.0374,16.42226,16.15946,16.16678043432028,0.02448,16.04801,15.81698,15.863904124935281,0.01904,15.84793,15.83753,15.916352124022405,0.01724
2063.61463944,,,,,,,,,,,,,18.18077,17.35616,17.294591065419613,0.10578,17.10944,17.32812,17.140937435752633,0.04367,16.55406,16.33046,16.478095840634346,0.0288,16.1779,15.92551,16.039524257021114,0.02236,15.95438,15.94777,16.08380386652519,0.01982
2063.63507167,18.9803,16.83404,16.657565057533308,0.19499,,,,,18.9803,16.83404,16.657565057533308,0.19499,17.69246,16.78665,16.764669813016358,0.06608,16.96315,17.13211,17.263977347737427,0.03738,16.50592,16.30574,16.579744524124337,0.02698,16.17641,15.86116,15.889513479987725,0.02187,15.96747,15.947,16.165472038152032,0.01964
2063.65550371,15.89871,16.34482,16.23012549094771,0.02027,,,,,15.89871,16.34482,16.23012549094771,0.02027,15.8822,16.74514,16.5332263843586,0.02212,16.1912,17.17006,17.064400442946923,0.03251,16.94117,17.78705,17.608504740776546,0.07126,,,,,,,,
2063.67593585,14.85808,15.69167,16.030010695063147,0.00937,,,,,14.85808,15.69167,16.030010695063147,0.00937,14.78262,16.0045,16.811381446538153,0.00969,14.87686,16.268,17.776758342443962,0.01168,15.08039,15.68995,17.244379947080247,0.01547,15.39695,20.70525,20.060881187701057,0.02271,15.82929,15.99737,16.225712028607123,0.03681
2063.69636809,15.03013,15.78325,16.431686871418606,0.01035,,,,,15.03013,15.78325,16.431686871418606,0.01035,14.95421,16.09108,16.671048856521786,0.01069,15.06493,16.36935,17.47151847847027,0.01309,15.3086,16.01196,16.67179040731201,0.01799,15.71465,20.41319,20.45235331015714,0.02868,16.30648,16.27154,16.3442041673453,0.05384
2063.71680013,15.65646,16.3761,16.37741060217137,0.01793,,,,,15.65646,16.3761,16.37741060217137,0.01793,15.6313,16.72312,16.443890927631294,0.01942,15.94879,17.20781,17.083281278211366,0.02876,16.7801,17.5157,17.486522587839215,0.06793,,,,,,,,
2063.73723226,15.73989,16.32118,16.360448628002253,0.01918,,,,,15.73989,16.32118,16.360448628002253,0.01918,15.70483,16.64945,16.466059718473815,0.02058,16.02067,17.11748,16.921070593362636,0.03044,16.8567,17.68197,17.47229578683892,0.07221,,,,,,,,
2063.7576645,15.8239,16.23847,16.20763093585149,0.02076,,,,,15.8239,16.23847,16.20763093585149,0.02076,15.76327,16.5351,16.4534102952084,0.02176,16.04822,16.94514,16.767663600280756,0.03128,16.79688,17.6786,17.506796192292786,0.06847,,,,,,,,
2063.77809653,16.4308,16.72501,16.66663507788365,0.03734,,,,,16.4308,16.72501,16.66663507788365,0.03734,16.41753,17.01474,16.884722311289234,0.0409,17.05787,17.77073,17.52504657660534,0.08156,,,,,,,,,,,,
2063.79852867,16.41576,16.73073,16.667720217249215,0.0375,,,,,16.41576,16.73073,16.667720217249215,0.0375,16.40057,17.01042,16.80644527612699,0.041,17.03781,17.76955,17.262097022679733,0.08153,,,,,,,,,,,,
2063.81896091,15.69081,15.98021,16.324779438966946,0.01788,,,,,15.69081,15.98021,16.324779438966946,0.01788,15.58608,16.14996,16.615355626998223,0.018,15.74824,16.43508,16.925902289271114,0.0231,16.156,16.91406,16.972044165180126,0.03695,17.0783,19.29939,19.324657146133717,0.09477,22.2061,21.55732,21.638793358929117,11.60358
2063.83939294,15.66527,15.85918,16.26568133322844,0.01706,,,,,15.66527,15.85918,16.26568133322844,0.01706,15.54531,15.98463,16.64091894400694,0.01693,15.67762,16.23208,17.03755986083587,0.02115,16.02401,16.68287,16.927407088370394,0.03196,16.73208,18.18165,18.261106363822584,0.0673,18.0794,17.29718,17.41490297961243,0.25336
2063.85982507,16.47914,16.45841,16.622669983241213,0.03739,,,,,16.47914,16.45841,16.622669983241213,0.03739,16.37342,16.62041,16.854654240063542,0.03761,16.7581,17.08237,17.199037677451553,0.05927,18.19323,18.37106,18.50165179165494,0.24423,,,,,,,,
2063.88025731,15.7156,15.81334,16.276031640768995,0.01752,,,,,15.7156,15.81334,16.276031640768995,0.01752,15.58352,15.89638,16.476979879016934,0.01719,15.7062,16.12973,16.69037098580593,0.02128,16.04355,16.57121,16.854658777403852,0.0319,16.73564,17.40375,17.42417332856414,0.06619,18.01751,17.0982,17.379623912771173,0.2346
2063.90068934,17.98213,17.5152,17.39802266005912,0.14733,,,,,17.98213,17.5152,17.39802266005912,0.14733,17.83425,17.81947,17.517812201556566,0.14256,,,,,,,,,,,,,,,,
2063.92112157,14.99613,15.00172,16.14867562474824,0.00938,,,,,14.99613,15.00172,16.14867562474824,0.00938,14.85939,15.08075,16.554513876658493,0.00917,14.88454,15.20405,17.337814489993814,0.01037,15.00569,15.25274,16.475743234522845,0.01274,15.19861,16.03306,16.216463991117724,0.01668,15.46273,14.97274,15.611802509006573,0.02315
2063.94155371,,,,,,,,,,,,,,,,,,,,,,,,,,,,,,,,
2063.96198574,,,,,,,,,,,,,,,,,,,,,,,,,,,,,,,,
2063.98241797,,,,,,,,,,,,,,,,,,,,,,,,,,,,,,,,
2064.0028501,,,,,,,,,,,,,,,,,,,,,,,,,,,,,,,,
2064.02328213,,,,,,,,,,,,,,,,,,,,,,,,,,,,,,,,
2064.04371436,,,,,,,,,,,,,,,,,,,,,,,,,,,,,,,,
2064.06414649,,,,,,,,,,,,,,,,,,,,,,,,,,,,,,,,
2064.08457852,,,,,,,,,,,,,,,,,,,,,,,,,,,,,,,,
2064.10501075,,,,,,,,,,,,,,,,,,,,,,,,,,,,,,,,
2064.12544288,,,,,,,,,,,,,,,,,,,,,,,,,,,,,,,,
2064.55451747,,,,,,,,,,,,,,,,,,,,,,,,,,,,,,,,
2064.57494969,,,,,,,,,,,,,,,,,,,,,,,,,,,,,,,,
2064.59538181,,,,,,,,,,,,,,,,,,,,,,,,,,,,,,,,
2064.61581383,,,,,,,,,,,,,,,,,,,,,,,,,,,,,,,,
2064.63624605,,,,,,,,,,,,,,,,,,,,,,,,,,,,,,,,
2064.65667816,,,,,,,,,,,,,,,,,,,,,,,,,,,,,,,,
2064.73840653,,,,,,,,,,,,,,,,,,,,,19.69025,19.38179,19.36392418745947,0.6511,17.27472,16.47639,16.42407164937129,0.07728,16.70665,16.75024,16.662649967530772,0.04988
2064.75883874,,,,,,,,,,,,,,,,,,,,,,,,,17.52128,16.72986,16.777032225441218,0.10111,16.81411,16.85803,16.872461650611925,0.05741
2064.77927076,,,,,,,,,,,,,,,,,,,,,17.70801,17.40787,17.62177700909249,0.10479,16.86447,16.08218,16.19307315596426,0.0529,16.48182,16.63031,16.669094437985645,0.0405
2064.79970297,,,,,,,,,,,,,19.68219,17.80464,17.860107049357207,0.43796,17.16756,17.09511,17.015368701475484,0.04787,16.52074,16.34918,16.556233723356197,0.02902,16.13736,15.50322,15.533368061049098,0.02238,15.98294,16.54304,16.575502354975175,0.02114
2064.82013509,,,,,,,,,,,,,,,,,,,,,17.4447,17.1664,17.06014792935299,0.07606,16.6401,15.92428,15.898857086663728,0.03981,16.31082,16.84888,16.825771046206864,0.03201
2064.8405672,,,,,,,,,,,,,,,,,19.62158,19.52617,19.16584764408156,0.50664,17.30179,17.12637,17.025493150024893,0.0658,16.60717,15.98226,15.957558532271198,0.03811,16.29144,16.86134,16.820998111436275,0.03103
2064.86099931,,,,,,,,,,,,,,,,,,,,,17.61209,17.46682,17.22795666557882,0.0894,16.76409,16.17038,16.076503690544975,0.04495,16.38592,16.96851,16.90777173572786,0.03456
2064.88143142,,,,,,,,,,,,,,,,,,,,,,,,,,,,,,,,
2064.90186354,16.67448,15.71775,16.067265935523448,0.04309,,,,,16.67448,15.71775,16.067265935523448,0.04309,16.48565,15.64992,15.962997350600597,0.04015,16.81117,16.15476,16.666144546221553,0.05993,18.04004,16.48359,16.73295035187496,0.20423,,,,,,,,
2064.92229565,16.90215,15.66643,16.00840464208499,0.05158,,,,,16.90215,15.66643,16.00840464208499,0.05158,16.67367,15.70289,16.088247195208673,0.04634,17.03687,16.16398,16.7187274761809,0.07161,18.68779,16.27979,16.512646061412696,0.35999,,,,,,,,
2064.94272776,18.34029,16.91537,16.875698466870578,0.20209,,,,,18.34029,16.91537,16.875698466870578,0.20209,17.78929,16.67846,16.60448327043085,0.13492,19.2164,18.15885,18.050376253653955,0.55553,,,,,,,,,,,,
2064.96315987,,,,,,,,,,,,,18.67191,17.71956,17.781197931833862,0.27672,24.32146,24.04867,24.416945625604658,55.67926,,,,,,,,,,,,
2064.98359208,,,,,,,,,,,,,,,,,,,,,,,,,,,,,,,,
2065.00402409,,,,,,,,,,,,,,,,,,,,,,,,,,,,,,,,
2065.0244562,,,,,,,,,,,,,19.43992,18.53051,18.49766035169567,0.54386,,,,,,,,,,,,,,,,